Target
D(2) dopamine receptor
Ligand
BDBM50184429
Substrate
Meas. Tech.
ChEMBL_603131 (CHEMBL1038853)
Ki
13±n/a nM
Citation
 Schulze, MMüller, FKMason, JMGörls, HLehmann, JEnzensperger, C Dibenzazecine scaffold rebuilding--is the flexibility always essential for high dopamine receptor affinities? Bioorg Med Chem 17:6898-907 (2009)  
Target
Name:
D(2) dopamine receptor
Synonyms:
D(2) dopamine receptor DOPAMINE D2 Long DRD2 Dopamine D2 receptor Dopamine D2 receptor (D2R) Dopamine2-like | d2
Type:
Cell-surface receptors
Mol. Mass.:
50647.10
Organism:
Homo sapiens (Human)
Description:
P14416
Residue:
443
  
Inhibitor
Name:
BDBM50184429
Synonyms:
16-methoxy-11-methyl-11-aza-tricyclo[12.4.0.03,8]octadeca-1(18),3(8),4,6,14,16-hexaene 6-methoxy-11-methyl-11-aza-tricyclo[12.4.0.0.3,8]octadeca-1(18),3(8),4,6,14,16-hexaene | CHEMBL380330
Type:
Small organic molecule
Emp. Form.:
C19H23NO
Mol. Mass.:
281.392
SMILES:
COc1ccc2Cc3ccccc3CCN(C)CCc2c1
: