Target
D(2) dopamine receptor
Ligand
BDBM50304397
Substrate
Meas. Tech.
ChEMBL_603131 (CHEMBL1038853)
Ki
320±n/a nM
Citation
 Schulze, MMüller, FKMason, JMGörls, HLehmann, JEnzensperger, C Dibenzazecine scaffold rebuilding--is the flexibility always essential for high dopamine receptor affinities? Bioorg Med Chem 17:6898-907 (2009)  
Target
Name:
D(2) dopamine receptor
Synonyms:
D(2) dopamine receptor DOPAMINE D2 Long DRD2 Dopamine D2 receptor Dopamine D2 receptor (D2R) Dopamine2-like | d2
Type:
Cell-surface receptors
Mol. Mass.:
50647.10
Organism:
Homo sapiens (Human)
Description:
P14416
Residue:
443
  
Inhibitor
Name:
BDBM50304397
Synonyms:
3-Methoxy-5,8,13,13a-tetrahydro-6H-isoquino[3,2-a]isoquinoline | CHEMBL596448
Type:
Small organic molecule
Emp. Form.:
C18H19NO
Mol. Mass.:
265.3496
SMILES:
COc1ccc2C3Cc4ccccc4CN3CCc2c1
: