Target
D(3) dopamine receptor
Ligand
BDBM50304397
Substrate
Meas. Tech.
ChEMBL_603132 (CHEMBL1038854)
Ki
251±n/a nM
Citation
 Schulze, MMüller, FKMason, JMGörls, HLehmann, JEnzensperger, C Dibenzazecine scaffold rebuilding--is the flexibility always essential for high dopamine receptor affinities? Bioorg Med Chem 17:6898-907 (2009)  
Target
Name:
D(3) dopamine receptor
Synonyms:
DOPAMINE D3 DRD3_HUMAN Dopamine D3 receptor (D3) Dopamine receptor Dopamine receptor D3
Type:
Mol. Mass.:
44243.43
Organism:
Homo sapiens (Human)
Description:
Residue:
400
  
Inhibitor
Name:
BDBM50304397
Synonyms:
3-Methoxy-5,8,13,13a-tetrahydro-6H-isoquino[3,2-a]isoquinoline | CHEMBL596448
Type:
Small organic molecule
Emp. Form.:
C18H19NO
Mol. Mass.:
265.3496
SMILES:
COc1ccc2C3Cc4ccccc4CN3CCc2c1
: