Target
D(4) dopamine receptor
Ligand
BDBM50304398
Substrate
Meas. Tech.
ChEMBL_603133 (CHEMBL1038855)
Ki
5092±n/a nM
Citation
 Schulze, MMüller, FKMason, JMGörls, HLehmann, JEnzensperger, C Dibenzazecine scaffold rebuilding--is the flexibility always essential for high dopamine receptor affinities? Bioorg Med Chem 17:6898-907 (2009)  
Target
Name:
D(4) dopamine receptor
Synonyms:
D(2C) dopamine receptor DOPAMINE D4.2 DRD4 Dopamine D4 receptor
Type:
Enzyme
Mol. Mass.:
48373.19
Organism:
Homo sapiens (Human)
Description:
P21917
Residue:
419
  
Inhibitor
Name:
BDBM50304398
Synonyms:
5,8,13,13a-Tetrahydro-6H-isoquino[3,2-a]isoquinolin-3-ol | CHEMBL593897
Type:
Small organic molecule
Emp. Form.:
C17H17NO
Mol. Mass.:
251.323
SMILES:
Oc1ccc2C3Cc4ccccc4CN3CCc2c1
: