Target
D(1B) dopamine receptor
Ligand
BDBM50304398
Substrate
Meas. Tech.
ChEMBL_603134 (CHEMBL1038856)
Ki
41.1±n/a nM
Citation
 Schulze, MMüller, FKMason, JMGörls, HLehmann, JEnzensperger, C Dibenzazecine scaffold rebuilding--is the flexibility always essential for high dopamine receptor affinities? Bioorg Med Chem 17:6898-907 (2009)  
Target
Name:
D(1B) dopamine receptor
Synonyms:
D(5) dopamine receptor DOPAMINE D5 DRD1L2 DRD5_HUMAN | dopamine receptor D5
Type:
Protein
Mol. Mass.:
52943.41
Organism:
Homo sapiens (Human)
Description:
P21918
Residue:
477
  
Inhibitor
Name:
BDBM50304398
Synonyms:
5,8,13,13a-Tetrahydro-6H-isoquino[3,2-a]isoquinolin-3-ol | CHEMBL593897
Type:
Small organic molecule
Emp. Form.:
C17H17NO
Mol. Mass.:
251.323
SMILES:
Oc1ccc2C3Cc4ccccc4CN3CCc2c1
: