Target
D(3) dopamine receptor
Ligand
BDBM50378584
Substrate
Meas. Tech.
ChEMBL_603139 (CHEMBL1038861)
Ki
30±n/a nM
Citation
 Schulze, MMüller, FKMason, JMGörls, HLehmann, JEnzensperger, C Dibenzazecine scaffold rebuilding--is the flexibility always essential for high dopamine receptor affinities? Bioorg Med Chem 17:6898-907 (2009)  
Target
Name:
D(3) dopamine receptor
Synonyms:
DOPAMINE D3 Dopamine D3 receptor | Drd3
Type:
Protein
Mol. Mass.:
49540.58
Organism:
Rattus norvegicus (Rat)
Description:
P19020
Residue:
446
  
Inhibitor
Name:
BDBM50378584
Synonyms:
STEPHOLIDINE
Type:
Small organic molecule
Emp. Form.:
C19H21NO4
Mol. Mass.:
327.3743
SMILES:
COc1cc2CCN3Cc4c(C[C@H]3c2cc1O)ccc(O)c4OC
: