Target
Vasopressin V2 receptor
Ligand
BDBM50307119
Substrate
Meas. Tech.
ChEMBL_609622 (CHEMBL1065237)
Ki
913±n/a nM
Citation
 Frantz, MCRodrigo, JBoudier, LDurroux, TMouillac, BHibert, M Subtlety of the structure-affinity and structure-efficacy relationships around a nonpeptide oxytocin receptor agonist. J Med Chem 53:1546-62 (2010)  
Target
Name:
Vasopressin V2 receptor
Synonyms:
ADHR AVPR2 DIR Renal-type arginine vasopressin receptor V2R_HUMAN Vasopressin V2 receptor | Vasopressin receptor
Type:
Receptor
Mol. Mass.:
40295.28
Organism:
Homo sapiens (Human)
Description:
P30518
Residue:
371
  
Inhibitor
Name:
BDBM50307119
Synonyms:
1-Methyl-5-[3-methyl-4-(3-methyl-1H-pyrazol-1-yl)benzoyl]-1,4,5,10-tetrahydropyrazolo[3,4-b][1,5]benzodiazepine | CHEMBL605373
Type:
Small organic molecule
Emp. Form.:
C23H22N6O
Mol. Mass.:
398.4604
SMILES:
Cc1ccn(n1)-c1ccc(cc1C)C(=O)N1Cc2cnn(C)c2Nc2ccccc12
: