Target
Vasopressin V1a receptor
Ligand
BDBM50307119
Substrate
Meas. Tech.
ChEMBL_609618 (CHEMBL1065233)
Ki
18±n/a nM
Citation
 Frantz, MCRodrigo, JBoudier, LDurroux, TMouillac, BHibert, M Subtlety of the structure-affinity and structure-efficacy relationships around a nonpeptide oxytocin receptor agonist. J Med Chem 53:1546-62 (2010)  
Target
Name:
Vasopressin V1a receptor
Synonyms:
AVPR V1a AVPR1A V1AR_HUMAN VASOPRESSIN V1A Vasopressin V1 receptor Vasopressin receptor
Type:
Receptor
Mol. Mass.:
46820.18
Organism:
Homo sapiens (Human)
Description:
P37288
Residue:
418
  
Inhibitor
Name:
BDBM50307119
Synonyms:
1-Methyl-5-[3-methyl-4-(3-methyl-1H-pyrazol-1-yl)benzoyl]-1,4,5,10-tetrahydropyrazolo[3,4-b][1,5]benzodiazepine | CHEMBL605373
Type:
Small organic molecule
Emp. Form.:
C23H22N6O
Mol. Mass.:
398.4604
SMILES:
Cc1ccn(n1)-c1ccc(cc1C)C(=O)N1Cc2cnn(C)c2Nc2ccccc12
: