Target
Tyrosine-protein phosphatase non-receptor type 2
Ligand
BDBM13990
Substrate
Meas. Tech.
ChEMBL_608731 (CHEMBL1067744)
Ki
164000±n/a nM
Citation
 Ye, DZhang, YWang, FZheng, MZhang, XLuo, XShen, XJiang, HLiu, H Novel thiophene derivatives as PTP1B inhibitors with selectivity and cellular activity. Bioorg Med Chem 18:1773-82 (2010)  
Target
Name:
Tyrosine-protein phosphatase non-receptor type 2
Synonyms:
PTN2_HUMAN PTPT T-cell protein-tyrosine phosphatase TCPTP Tyrosine-protein phosphatase non-receptor type 2 (TC-PTP)
Type:
Protein
Mol. Mass.:
48481.80
Organism:
Homo sapiens (Human)
Description:
P17706
Residue:
415
  
Inhibitor
Name:
BDBM13990
Synonyms:
5-{2-fluoro-5-[(1E)-3-[3-hydroxy-2-(methoxycarbonyl)phenoxy]prop-1-en-1-yl]phenyl}-1,2-oxazole-3-carboxylic acid Isoxazole carboxylic acid analog 1
Type:
Small organic molecule
Emp. Form.:
C21H16FNO7
Mol. Mass.:
413.3526
SMILES:
COC(=O)c1c(O)cccc1OC\C=C\c1ccc(F)c(c1)-c1cc(no1)C(O)=O
: