Target
Carbonic anhydrase 3
Ligand
BDBM4078
Substrate
Meas. Tech.
ChEMBL_613330 (CHEMBL1074267)
Ki
10500±n/a nM
Citation
 Innocenti, ABeyza Oztürk Sarikaya, SGülçin, ISupuran, CT Carbonic anhydrase inhibitors. Inhibition of mammalian isoforms I-XIV with a series of natural product polyphenols and phenolic acids. Bioorg Med Chem 18:2159-64 (2010)  
Target
Name:
Carbonic anhydrase 3
Synonyms:
CA-III CAH3_HUMAN Carbonic Anhydrase III Carbonic anhydrase 3 (CA III) | Carbonic anhydrase III (CA III)
Type:
Enzyme
Mol. Mass.:
29562.11
Organism:
Homo sapiens (Human)
Description:
Human cloned isozyme.
Residue:
260
  
Inhibitor
Name:
BDBM4078
Synonyms:
6,7,13,14-tetrahydroxy-2,9-dioxatetracyclo[6.6.2.0^{4,16}.0^{11,15}]hexadeca-1(14),4(16),5,7,11(15),12-hexaene-3,10-dione ELLAGIC ACID Ellagic acid (18) MLS000069632 cid_5281855
Type:
Small organic molecule
Emp. Form.:
C14H6O8
Mol. Mass.:
302.1926
SMILES:
Oc1cc2c3c(oc(=O)c4cc(O)c(O)c(oc2=O)c34)c1O
: