Target
Adenosine receptor A3
Ligand
BDBM50308487
Substrate
Meas. Tech.
ChEMBL_613362 (CHEMBL1064296)
Ki
208±n/a nM
Citation
 Scheiff, ABYerande, SGEl-Tayeb, ALi, WInamdar, GSVasu, KKSudarsanam, VMüller, CE 2-Amino-5-benzoyl-4-phenylthiazoles: Development of potent and selective adenosine A1 receptor antagonists. Bioorg Med Chem 18:2195-203 (2010)  
Target
Name:
Adenosine receptor A3
Synonyms:
A3 adenosine receptor (hA3) ADORA3 | Adenosine A3 receptor (A3AR)
Type:
G Protein-Coupled Receptor (GPCR)
Mol. Mass.:
36197.32
Organism:
Homo sapiens (Human)
Description:
P0DMS8
Residue:
318
  
Inhibitor
Name:
BDBM50308487
Synonyms:
CHEMBL591710 | N-(5-Benzoyl-4-phenylthiazol-2-yl)furan-2-carboxamide
Type:
Small organic molecule
Emp. Form.:
C21H14N2O3S
Mol. Mass.:
374.412
SMILES:
O=C(Nc1nc(c(s1)C(=O)c1ccccc1)-c1ccccc1)c1ccco1
: