Target
Succinyl-diaminopimelate desuccinylase
Ligand
BDBM26996
Substrate
Meas. Tech.
ChEMBL_617888 (CHEMBL1101553)
Ki
56900±n/a nM
Citation
 Gillner, DArmoush, NHolz, RCBecker, DP Inhibitors of bacterial N-succinyl-L,L-diaminopimelic acid desuccinylase (DapE) and demonstration of in vitro antimicrobial activity. Bioorg Med Chem Lett 19:6350-2 (2009)  
Target
Name:
Succinyl-diaminopimelate desuccinylase
Synonyms:
DAPE_HAEIN | dapE
Type:
PROTEIN
Mol. Mass.:
41343.05
Organism:
Haemophilus influenzae
Description:
ChEMBL_617887
Residue:
377
  
Inhibitor
Name:
BDBM26996
Synonyms:
CHEMBL21485 Phenyl-boronic acid benzeneboronic acid phenylboronic acid
Type:
Emp. Form.:
C6H7BO2
Mol. Mass.:
121.93
SMILES:
OB(O)c1ccccc1
: