Target
Glucocorticoid receptor
Ligand
BDBM50113777
Substrate
Meas. Tech.
ChEMBL_624272 (CHEMBL1106116)
Ki
6±n/a nM
Citation
 Onnis, VKinsella, GKCarta, GJagoe, WNPrice, TWilliams, DCFayne, DLloyd, DG Virtual screening for the identification of novel nonsteroidal glucocorticoid modulators. J Med Chem 53:3065-74 (2010)  
Target
Name:
Glucocorticoid receptor
Synonyms:
GCR_HUMAN GRL Glucocorticoid receptor (GRFP) Nuclear receptor subfamily 3 group C member 1
Type:
Enzyme
Mol. Mass.:
85656.87
Organism:
Homo sapiens (Human)
Description:
P04150
Residue:
777
  
Inhibitor
Name:
BDBM50113777
Synonyms:
(4aS,10aR)-4a-benzyl-7-hydroxy-3,4,4a,9,10,10a-hexahydrophenanthren-2(1H)-one CHEMBL310180
Type:
Small organic molecule
Emp. Form.:
C21H22O2
Mol. Mass.:
306.3982
SMILES:
Oc1ccc2c(CC[C@@H]3CC(=O)CC[C@@]23Cc2ccccc2)c1
: