Target
Glucocorticoid receptor
Ligand
BDBM50315766
Substrate
Meas. Tech.
ChEMBL_624272 (CHEMBL1106116)
Ki
18±n/a nM
Citation
 Onnis, VKinsella, GKCarta, GJagoe, WNPrice, TWilliams, DCFayne, DLloyd, DG Virtual screening for the identification of novel nonsteroidal glucocorticoid modulators. J Med Chem 53:3065-74 (2010)  
Target
Name:
Glucocorticoid receptor
Synonyms:
GCR_HUMAN GRL Glucocorticoid receptor (GRFP) Nuclear receptor subfamily 3 group C member 1
Type:
Enzyme
Mol. Mass.:
85656.87
Organism:
Homo sapiens (Human)
Description:
P04150
Residue:
777
  
Inhibitor
Name:
BDBM50315766
Synonyms:
(S)-9-methoxy-2,2,4-trimethyl-5-phenyl-2,5-dihydro-1H-chromeno[3,4-f]quinoline | CHEMBL1089811
Type:
Small organic molecule
Emp. Form.:
C26H25NO2
Mol. Mass.:
383.4822
SMILES:
COc1ccc2O[C@@H](c3ccccc3)c3c(ccc4NC(C)(C)C=C(C)c34)-c2c1
: