Target
Glucocorticoid receptor
Ligand
BDBM50124614
Substrate
Meas. Tech.
ChEMBL_624272 (CHEMBL1106116)
Ki
2.8±n/a nM
Citation
 Onnis, VKinsella, GKCarta, GJagoe, WNPrice, TWilliams, DCFayne, DLloyd, DG Virtual screening for the identification of novel nonsteroidal glucocorticoid modulators. J Med Chem 53:3065-74 (2010)  
Target
Name:
Glucocorticoid receptor
Synonyms:
GCR_HUMAN GRL Glucocorticoid receptor (GRFP) Nuclear receptor subfamily 3 group C member 1
Type:
Enzyme
Mol. Mass.:
85656.87
Organism:
Homo sapiens (Human)
Description:
P04150
Residue:
777
  
Inhibitor
Name:
BDBM50124614
Synonyms:
5-Allyl-10-methoxy-2,2,4-trimethyl-2,5-dihydro-1H-6-oxa-1-aza-chrysene-9-carboxylic acid methyl ester methyl 5-allyl-10-methoxy-2,2,4-trimethyl-2,5-dihydro-1H-chromeno[3,4-f]quinoline-9-carboxylate
Type:
Small organic molecule
Emp. Form.:
C25H27NO4
Mol. Mass.:
405.4862
SMILES:
COC(=O)c1ccc2OC(CC=C)c3c(ccc4NC(C)(C)C=C(C)c34)-c2c1OC
: