Target
Glucocorticoid receptor
Ligand
BDBM50049497
Substrate
Meas. Tech.
ChEMBL_624272 (CHEMBL1106116)
Ki
3210±n/a nM
Citation
 Onnis, VKinsella, GKCarta, GJagoe, WNPrice, TWilliams, DCFayne, DLloyd, DG Virtual screening for the identification of novel nonsteroidal glucocorticoid modulators. J Med Chem 53:3065-74 (2010)  
Target
Name:
Glucocorticoid receptor
Synonyms:
GCR_HUMAN GRL Glucocorticoid receptor (GRFP) Nuclear receptor subfamily 3 group C member 1
Type:
Enzyme
Mol. Mass.:
85656.87
Organism:
Homo sapiens (Human)
Description:
P04150
Residue:
777
  
Inhibitor
Name:
BDBM50049497
Synonyms:
5-Bromo-2-((1R,3R)-3-bromo-2,2-dimethyl-6-methylene-cyclohexylmethyl)-4-methoxy-phenol | CHEMBL51639
Type:
Small organic molecule
Emp. Form.:
C17H22Br2O2
Mol. Mass.:
418.163
SMILES:
COc1cc(C[C@@H]2C(=C)CC[C@@H](Br)C2(C)C)c(O)cc1Br
: