Target
Melatonin receptor type 1A
Ligand
BDBM50035179
Substrate
Meas. Tech.
ChEMBL_632475 (CHEMBL1108339)
EC50
1.6±n/a nM
Citation
 Mésangeau, CPérès, BDescamps-François, CChavatte, PAudinot, VCoumailleau, SBoutin, JADelagrange, PBennejean, CRenard, PCaignard, DHBerthelot, PYous, S Design, synthesis and pharmacological evaluation of novel naphthalenic derivatives as selective MT(1) melatoninergic ligands. Bioorg Med Chem 18:3426-36 (2010)  
Target
Name:
Melatonin receptor type 1A
Synonyms:
MTNR1A MTR1A_HUMAN Mel1a melatonin receptor Melatonin receptor Melatonin receptor type 1 (MT1) | Melatonin receptor type 1A
Type:
Enzyme
Mol. Mass.:
39392.94
Organism:
Homo sapiens (Human)
Description:
P48039
Residue:
350
  
Inhibitor
Name:
BDBM50035179
Synonyms:
Agomelatine N-[2-(7-Methoxy-naphthalen-1-yl)-ethyl]-acetamide S 20098 US11091445, Compound code IA2-76
Type:
Small organic molecule
Emp. Form.:
C15H17NO2
Mol. Mass.:
243.301
SMILES:
COc1ccc2cccc(CCNC(C)=O)c2c1
: