Target
Bombesin receptor subtype-3
Ligand
BDBM50317471
Substrate
Meas. Tech.
ChEMBL_631838 (CHEMBL1111909)
EC50
7652±n/a nM
Citation
 Guo, CGuzzo, PRHadden, MSargent, BJYet, LKan, YPalyha, OKelly, TMGuan, XRosko, KGagen, KMetzger, JMDragovic, JLyons, KLin, LSNargund, RP Synthesis of 7-benzyl-5-(piperidin-1-yl)-6,7,8,9-tetrahydro-3H-pyrazolo[3,4-c][2,7]naphthyridin-1-ylamine and its analogs as bombesin receptor subtype-3 agonists. Bioorg Med Chem Lett 20:2785-9 (2010)  
Target
Name:
Bombesin receptor subtype-3
Synonyms:
BRS3_RAT Brs3
Type:
Enzyme Catalytic Domain
Mol. Mass.:
44213.49
Organism:
RAT
Description:
Bombesin 0 RAT::Q8K418
Residue:
399
  
Inhibitor
Name:
BDBM50317471
Synonyms:
7-benzyl-N5-isopropyl-6,7,8,9-tetrahydro-3H-pyrazolo[3,4-c][2,7]naphthyridine-1,5-diamine | CHEMBL1097551
Type:
Small organic molecule
Emp. Form.:
C19H24N6
Mol. Mass.:
336.4341
SMILES:
CC(C)Nc1nc2[nH]nc(N)c2c2CCN(Cc3ccccc3)Cc12
: