Target
cGMP-specific 3',5'-cyclic phosphodiesterase
Ligand
BDBM50316653
Substrate
Meas. Tech.
ChEMBL_632175 (CHEMBL1106508)
IC50
1.8±n/a nM
Citation
 Tollefson, MBAcker, BAJacobsen, EJHughes, ROWalker, JKFox, DNPalmer, MJFreeman, SKYu, YBond, BR 1-(2-(2,2,2-trifluoroethoxy)ethyl-1H-pyrazolo[4,3-d]pyrimidines as potent phosphodiesterase 5 (PDE5) inhibitors. Bioorg Med Chem Lett 20:3125-8 (2010)  
Target
Name:
cGMP-specific 3',5'-cyclic phosphodiesterase
Synonyms:
3',5'-cyclic phosphodiesterase PDE5 PDE5A_HUMAN Phosphodiesterase 5 (PDE5) Phosphodiesterase 5A (PDE5A) cGMP-specific 3',5'-cyclic phosphodiesterase
Type:
Protein
Mol. Mass.:
99975.83
Organism:
Homo sapiens (Human)
Description:
O76074
Residue:
875
  
Inhibitor
Name:
BDBM50316653
Synonyms:
1-(2-ethoxyethyl)-3-ethyl-N-(4-methylpyridin-2-yl)-5-(piperazin-1-yl)-1H-pyrazolo[4,3-d]pyrimidin-7-amine CHEMBL1095176
Type:
Small organic molecule
Emp. Form.:
C21H30N8O
Mol. Mass.:
410.5159
SMILES:
CCOCCn1nc(CC)c2nc(nc(Nc3cccc(C)n3)c12)N1CCNCC1
: