Target
cGMP-specific 3',5'-cyclic phosphodiesterase
Ligand
BDBM50318145
Substrate
Meas. Tech.
ChEMBL_632175 (CHEMBL1106508)
IC50
9.8±n/a nM
Citation
 Tollefson, MBAcker, BAJacobsen, EJHughes, ROWalker, JKFox, DNPalmer, MJFreeman, SKYu, YBond, BR 1-(2-(2,2,2-trifluoroethoxy)ethyl-1H-pyrazolo[4,3-d]pyrimidines as potent phosphodiesterase 5 (PDE5) inhibitors. Bioorg Med Chem Lett 20:3125-8 (2010)  
Target
Name:
cGMP-specific 3',5'-cyclic phosphodiesterase
Synonyms:
3',5'-cyclic phosphodiesterase PDE5 PDE5A_HUMAN Phosphodiesterase 5 (PDE5) Phosphodiesterase 5A (PDE5A) cGMP-specific 3',5'-cyclic phosphodiesterase
Type:
Protein
Mol. Mass.:
99975.83
Organism:
Homo sapiens (Human)
Description:
O76074
Residue:
875
  
Inhibitor
Name:
BDBM50318145
Synonyms:
5-(1,4-diazepan-1-yl)-3-methyl-N-(pyrimidin-4-yl)-1-(2-(2,2,2-trifluoroethoxy)ethyl)-1H-pyrazolo[4,3-d]pyrimidin-7-amine | CHEMBL1094098
Type:
Small organic molecule
Emp. Form.:
C19H24F3N9O
Mol. Mass.:
451.4488
SMILES:
Cc1nn(CCOCC(F)(F)F)c2c(Nc3ccncn3)nc(nc12)N1CCCNCC1
: