Target
cGMP-specific 3',5'-cyclic phosphodiesterase
Ligand
BDBM50318148
Substrate
Meas. Tech.
ChEMBL_632175 (CHEMBL1106508)
IC50
0.350000±n/a nM
Citation
 Tollefson, MBAcker, BAJacobsen, EJHughes, ROWalker, JKFox, DNPalmer, MJFreeman, SKYu, YBond, BR 1-(2-(2,2,2-trifluoroethoxy)ethyl-1H-pyrazolo[4,3-d]pyrimidines as potent phosphodiesterase 5 (PDE5) inhibitors. Bioorg Med Chem Lett 20:3125-8 (2010)  
Target
Name:
cGMP-specific 3',5'-cyclic phosphodiesterase
Synonyms:
3',5'-cyclic phosphodiesterase PDE5 PDE5A_HUMAN Phosphodiesterase 5 (PDE5) Phosphodiesterase 5A (PDE5A) cGMP-specific 3',5'-cyclic phosphodiesterase
Type:
Protein
Mol. Mass.:
99975.83
Organism:
Homo sapiens (Human)
Description:
O76074
Residue:
875
  
Inhibitor
Name:
BDBM50318148
Synonyms:
3-ethyl-N5-methyl-N5-(1-methylpiperidin-4-yl)-N7-(pyrimidin-4-yl)-1-(2-(2,2,2-trifluoroethoxy)ethyl)-1H-pyrazolo[4,3-d]pyrimidine-5,7-diamine | CHEMBL1098751
Type:
Small organic molecule
Emp. Form.:
C22H30F3N9O
Mol. Mass.:
493.5285
SMILES:
CCc1nn(CCOCC(F)(F)F)c2c(Nc3ccncn3)nc(nc12)N(C)C1CCN(C)CC1
: