Target
Potassium voltage-gated channel subfamily H member 2
Ligand
BDBM50318137
Substrate
Meas. Tech.
ChEMBL_632181 (CHEMBL1106514)
IC50
1400±n/a nM
Citation
 Tollefson, MBAcker, BAJacobsen, EJHughes, ROWalker, JKFox, DNPalmer, MJFreeman, SKYu, YBond, BR 1-(2-(2,2,2-trifluoroethoxy)ethyl-1H-pyrazolo[4,3-d]pyrimidines as potent phosphodiesterase 5 (PDE5) inhibitors. Bioorg Med Chem Lett 20:3125-8 (2010)  
Target
Name:
Potassium voltage-gated channel subfamily H member 2
Synonyms:
1,3-beta-glucan synthase component GLS2 ERG Eag-related protein 1 Ether-a-go-go-related gene (HERG) Ether-a-go-go-related gene potassium channel 1 Ether-a-go-go-related gene potassium channel 1 (hERG1) Ether-a-go-go-related protein 1 H-ERG KCNH2 Potassium voltage-gated channel subfamily H member 2 (hERG) Voltage-gated potassium channel subunit Kv11.1 hERG Potassium Channel 1 | putative potassium channel subunit
Type:
Multi-pass membrane protein
Mol. Mass.:
126672.65
Organism:
Homo sapiens (Human)
Description:
Q12809
Residue:
1159
  
Inhibitor
Name:
BDBM50318137
Synonyms:
(R)-3-ethyl-5-(3-methylpiperazin-1-yl)-N-(pyrimidin-4-yl)-1-(2-(2,2,2-trifluoroethoxy)ethyl)-1H-pyrazolo[4,3-d]pyrimidin-7-amine | CHEMBL1095121
Type:
Small organic molecule
Emp. Form.:
C20H26F3N9O
Mol. Mass.:
465.4753
SMILES:
CCc1nn(CCOCC(F)(F)F)c2c(Nc3ccncn3)nc(nc12)N1CCN[C@H](C)C1
: