Target
Corticotropin-releasing factor receptor 1
Ligand
BDBM50060874
Substrate
Meas. Tech.
ChEMBL_629544 (CHEMBL1120962)
IC50
300±n/a nM
Citation
 Nahrstedt, AButterweck, V Lessons learned from herbal medicinal products: the example of St. John's Wort (perpendicular). J Nat Prod 73:1015-21 (2010)  
Target
Name:
Corticotropin-releasing factor receptor 1
Synonyms:
CRF-R CRF1 CRFR1 CRH-R 1 CRHR1 Corticotropin-releasing factor receptor 1 (CRF-1) Corticotropin-releasing hormone receptor 1
Type:
Enzyme
Mol. Mass.:
50744.31
Organism:
Homo sapiens (Human)
Description:
P34998
Residue:
444
  
Inhibitor
Name:
BDBM50060874
Synonyms:
1,3,4,6,8,13-hexahydroxy-10,11-dimethylphenanthro[1,10,9,8-opqra]perylene-7,14-dione CHEMBL286494 Hyperizin hypericine | hypericum red
Type:
Small organic molecule
Emp. Form.:
C30H16O8
Mol. Mass.:
504.4432
SMILES:
Cc1cc(O)c2c3c1c1c(C)cc(O)c4c1c1c3c3c(c(O)cc(O)c3c2=O)c2c(O)cc(O)c(c12)c4=O
: