Target
C-C chemokine receptor type 5
Ligand
BDBM50334986
Substrate
Meas. Tech.
ChEMBL_630265 (CHEMBL1106474)
IC50
14±n/a nM
Citation
 Rotstein, DMMelville, CRPadilla, FCournoyer, DLee, EKLemoine, RPetersen, ACSetti, LQWanner, JChen, LFilonova, LLoughhead, DGManka, JLin, XFGleason, SSankuratri, SJi, CDerosier, ADioszegi, MHeilek, GJekle, ABerry, PMau, CIWeller, P Novel hexahydropyrrolo[3,4-c]pyrrole CCR5 antagonists. Bioorg Med Chem Lett 20:3116-9 (2010)  
Target
Name:
C-C chemokine receptor type 5
Synonyms:
C-C CKR-5 CC-CKR-5 CCR5 CCR5_HUMAN CHEMR13 HIV-1 fusion coreceptor
Type:
Enzyme
Mol. Mass.:
40540.21
Organism:
Homo sapiens (Human)
Description:
P51681
Residue:
352
  
Inhibitor
Name:
BDBM50334986
Synonyms:
4,4-Difluoro-cyclohexanecarboxylic acid {(S)-3-[(1S,5S)-3-(3-isopropyl-5-methyl-[1,2,4]triazol-4-yl)-8-aza-bicyclo[3.2.1]oct-8-yl]-1-phenyl-propyl}-amide 4,4-difluoro-N-((S)-3-((1S,3S,5R)-3-(3-isopropyl-5-methyl-4H-1,2,4-triazol-4-yl)-8-aza-bicyclo[3.2.1]octan-8-yl)-1-phenylpropyl)cyclohexanecarboxamide CHEMBL1201187 Selzentry | UK-427857
Type:
Small organic molecule
Emp. Form.:
C29H41F2N5O
Mol. Mass.:
513.6655
SMILES:
CC(C)c1nnc(C)n1[C@H]1C[C@@H]2CC[C@H](C1)N2CC[C@H](NC(=O)C1CCC(F)(F)CC1)c1ccccc1
: