Target
C-C chemokine receptor type 5
Ligand
BDBM50318438
Substrate
Meas. Tech.
ChEMBL_630265 (CHEMBL1106474)
IC50
26±n/a nM
Citation
 Rotstein, DMMelville, CRPadilla, FCournoyer, DLee, EKLemoine, RPetersen, ACSetti, LQWanner, JChen, LFilonova, LLoughhead, DGManka, JLin, XFGleason, SSankuratri, SJi, CDerosier, ADioszegi, MHeilek, GJekle, ABerry, PMau, CIWeller, P Novel hexahydropyrrolo[3,4-c]pyrrole CCR5 antagonists. Bioorg Med Chem Lett 20:3116-9 (2010)  
Target
Name:
C-C chemokine receptor type 5
Synonyms:
C-C CKR-5 CC-CKR-5 CCR5 CCR5_HUMAN CHEMR13 HIV-1 fusion coreceptor
Type:
Enzyme
Mol. Mass.:
40540.21
Organism:
Homo sapiens (Human)
Description:
P51681
Residue:
352
  
Inhibitor
Name:
BDBM50318438
Synonyms:
CHEMBL1097816 | N-((S)-3-((3aR,6aS)-5-(4-methoxy-2,6-dimethylbenzoyl)hexahydropyrrolo[3,4-c]pyrrol-2(1H)-yl)-1-phenylpropyl)cyclopentanecarboxamide
Type:
Small organic molecule
Emp. Form.:
C31H41N3O3
Mol. Mass.:
503.6755
SMILES:
COc1cc(C)c(C(=O)N2C[C@@H]3CN(CC[C@H](NC(=O)C4CCCC4)c4ccccc4)C[C@@H]3C2)c(C)c1
: