Target
C-C chemokine receptor type 5
Ligand
BDBM50318450
Substrate
Meas. Tech.
ChEMBL_630265 (CHEMBL1106474)
IC50
15±n/a nM
Citation
 Rotstein, DMMelville, CRPadilla, FCournoyer, DLee, EKLemoine, RPetersen, ACSetti, LQWanner, JChen, LFilonova, LLoughhead, DGManka, JLin, XFGleason, SSankuratri, SJi, CDerosier, ADioszegi, MHeilek, GJekle, ABerry, PMau, CIWeller, P Novel hexahydropyrrolo[3,4-c]pyrrole CCR5 antagonists. Bioorg Med Chem Lett 20:3116-9 (2010)  
Target
Name:
C-C chemokine receptor type 5
Synonyms:
C-C CKR-5 CC-CKR-5 CCR5 CCR5_HUMAN CHEMR13 HIV-1 fusion coreceptor
Type:
Enzyme
Mol. Mass.:
40540.21
Organism:
Homo sapiens (Human)
Description:
P51681
Residue:
352
  
Inhibitor
Name:
BDBM50318450
Synonyms:
CHEMBL1096446 | N-((S)-3-((3aR,6aS)-5-(2,6-dimethylbenzoyl)hexahydropyrrolo[3,4-c]pyrrol-2(1H)-yl)-1-phenylpropyl)acetamide
Type:
Small organic molecule
Emp. Form.:
C26H33N3O2
Mol. Mass.:
419.5591
SMILES:
CC(=O)N[C@@H](CCN1C[C@H]2CN(C[C@H]2C1)C(=O)c1c(C)cccc1C)c1ccccc1
: