Target
Potassium voltage-gated channel subfamily H member 2
Ligand
BDBM50318668
Substrate
Meas. Tech.
ChEMBL_633292 (CHEMBL1119996)
IC50
>30000±n/a nM
Citation
 Yeung, BKZou, BRottmann, MLakshminarayana, SBAng, SHLeong, SYTan, JWong, JKeller-Maerki, SFischli, CGoh, ASchmitt, EKKrastel, PFrancotte, EKuhen, KPlouffe, DHenson, KWagner, TWinzeler, EAPetersen, FBrun, RDartois, VDiagana, TTKeller, TH Spirotetrahydro beta-carbolines (spiroindolones): a new class of potent and orally efficacious compounds for the treatment of malaria. J Med Chem 53:5155-64 (2010)  
Target
Name:
Potassium voltage-gated channel subfamily H member 2
Synonyms:
1,3-beta-glucan synthase component GLS2 ERG Eag-related protein 1 Ether-a-go-go-related gene (HERG) Ether-a-go-go-related gene potassium channel 1 Ether-a-go-go-related gene potassium channel 1 (hERG1) Ether-a-go-go-related protein 1 H-ERG KCNH2 Potassium voltage-gated channel subfamily H member 2 (hERG) Voltage-gated potassium channel subunit Kv11.1 hERG Potassium Channel 1 | putative potassium channel subunit
Type:
Multi-pass membrane protein
Mol. Mass.:
126672.65
Organism:
Homo sapiens (Human)
Description:
Q12809
Residue:
1159
  
Inhibitor
Name:
BDBM50318668
Synonyms:
(1R,3S)-5',7-Dichloro-3-methyl-2,3,4,9-tetrahydrospiro[beta-carboline-1,3'-indol]-2'(1'H)-one | CHEMBL1086475
Type:
Small organic molecule
Emp. Form.:
C19H15Cl2N3O
Mol. Mass.:
372.248
SMILES:
C[C@H]1Cc2c([nH]c3cc(Cl)ccc23)[C@@]2(N1)C(=O)Nc1ccc(Cl)cc21
: