Target
Potassium voltage-gated channel subfamily H member 2
Ligand
BDBM50188062
Substrate
Meas. Tech.
ChEMBL_634882 (CHEMBL1120514)
IC50
10900±n/a nM
Citation
 Fray, MJFish, PVAllan, GABish, GClarke, NEccles, RHarrison, ACLe Net, JLPhillips, SCRegan, NSobry, CStobie, AWakenhut, FWestbrook, DWestbrook, SLWhitlock, GA Second generation N-(1,2-diphenylethyl)piperazines as dual serotonin and noradrenaline reuptake inhibitors: improving metabolic stability and reducing ion channel activity. Bioorg Med Chem Lett 20:3788-92 (2010)  
Target
Name:
Potassium voltage-gated channel subfamily H member 2
Synonyms:
1,3-beta-glucan synthase component GLS2 ERG Eag-related protein 1 Ether-a-go-go-related gene (HERG) Ether-a-go-go-related gene potassium channel 1 Ether-a-go-go-related gene potassium channel 1 (hERG1) Ether-a-go-go-related protein 1 H-ERG KCNH2 Potassium voltage-gated channel subfamily H member 2 (hERG) Voltage-gated potassium channel subunit Kv11.1 hERG Potassium Channel 1 | putative potassium channel subunit
Type:
Multi-pass membrane protein
Mol. Mass.:
126672.65
Organism:
Homo sapiens (Human)
Description:
Q12809
Residue:
1159
  
Inhibitor
Name:
BDBM50188062
Synonyms:
1-(1-phenyl-2-(2-(trifluoromethoxy)phenyl)ethyl)piperazine | CHEMBL375131
Type:
Small organic molecule
Emp. Form.:
C19H21F3N2O
Mol. Mass.:
350.378
SMILES:
FC(F)(F)Oc1ccccc1CC(N1CCNCC1)c1ccccc1
: