Target
Cytochrome P450 2D6
Ligand
BDBM50188062
Substrate
Meas. Tech.
ChEMBL_634880 (CHEMBL1120512)
IC50
3600±n/a nM
Citation
 Fray, MJFish, PVAllan, GABish, GClarke, NEccles, RHarrison, ACLe Net, JLPhillips, SCRegan, NSobry, CStobie, AWakenhut, FWestbrook, DWestbrook, SLWhitlock, GA Second generation N-(1,2-diphenylethyl)piperazines as dual serotonin and noradrenaline reuptake inhibitors: improving metabolic stability and reducing ion channel activity. Bioorg Med Chem Lett 20:3788-92 (2010)  
Target
Name:
Cytochrome P450 2D6
Synonyms:
CP2D6_HUMAN CYP2DL1 Cytochrome P450 2D6 (CYP2D6) P450-DB1
Type:
Protein
Mol. Mass.:
55774.82
Organism:
Homo sapiens (Human)
Description:
P10635
Residue:
497
  
Inhibitor
Name:
BDBM50188062
Synonyms:
1-(1-phenyl-2-(2-(trifluoromethoxy)phenyl)ethyl)piperazine | CHEMBL375131
Type:
Small organic molecule
Emp. Form.:
C19H21F3N2O
Mol. Mass.:
350.378
SMILES:
FC(F)(F)Oc1ccccc1CC(N1CCNCC1)c1ccccc1
: