Target
Sodium-dependent dopamine transporter
Ligand
BDBM50188062
Substrate
Meas. Tech.
ChEMBL_634879 (CHEMBL1120511)
Ki
>10000±n/a nM
Citation
 Fray, MJFish, PVAllan, GABish, GClarke, NEccles, RHarrison, ACLe Net, JLPhillips, SCRegan, NSobry, CStobie, AWakenhut, FWestbrook, DWestbrook, SLWhitlock, GA Second generation N-(1,2-diphenylethyl)piperazines as dual serotonin and noradrenaline reuptake inhibitors: improving metabolic stability and reducing ion channel activity. Bioorg Med Chem Lett 20:3788-92 (2010)  
Target
Name:
Sodium-dependent dopamine transporter
Synonyms:
DA transporter DAT1 Dopamine transporter protein (DAT) SC6A3_HUMAN Sodium-dependent dopamine transporter Solute carrier family 6 member 3
Type:
Multi-pass membrane protein
Mol. Mass.:
68497.11
Organism:
Homo sapiens (Human)
Description:
Q01959
Residue:
620
  
Inhibitor
Name:
BDBM50188062
Synonyms:
1-(1-phenyl-2-(2-(trifluoromethoxy)phenyl)ethyl)piperazine | CHEMBL375131
Type:
Small organic molecule
Emp. Form.:
C19H21F3N2O
Mol. Mass.:
350.378
SMILES:
FC(F)(F)Oc1ccccc1CC(N1CCNCC1)c1ccccc1
: