Target
Histamine H3 receptor
Ligand
BDBM50321465
Substrate
Meas. Tech.
ChEMBL_640775 (CHEMBL1175767)
Ki
1±n/a nM
Citation
 Letavic, MAAluisio, LAtack, JRBonaventure, PCarruthers, NIDugovic, CEverson, AFeinstein, MAFraser, ICHoey, KJiang, XKeith, JMKoudriakova, TLeung, PLord, BLovenberg, TWLy, KSMorton, KLMotley, STNepomuceno, DRizzolio, MRynberg, RSepassi, KShelton, J Pre-clinical characterization of aryloxypyridine amides as histamine H3 receptor antagonists: identification of candidates for clinical development. Bioorg Med Chem Lett 20:4210-4 (2010)  
Target
Name:
Histamine H3 receptor
Synonyms:
G-protein coupled receptor 97 HH3R HRH3 Histamine H3 receptor (H3) Histamine receptor (H3 and H4)
Type:
G Protein-Coupled Receptor (GPCR)
Mol. Mass.:
48691.47
Organism:
Homo sapiens (Human)
Description:
Binding assays were using CHO cells stably expressing hH3R receptors.
Residue:
445
  
Inhibitor
Name:
BDBM50321465
Synonyms:
(6-(3-chlorophenoxy)pyridin-3-yl)(4-cyclobutyl-1,4-diazepan-1-yl)methanone | CHEMBL1171002
Type:
Small organic molecule
Emp. Form.:
C21H24ClN3O2
Mol. Mass.:
385.887
SMILES:
Clc1cccc(Oc2ccc(cn2)C(=O)N2CCCN(CC2)C2CCC2)c1
: