Target
Orexin receptor type 2
Ligand
BDBM50321514
Substrate
Meas. Tech.
ChEMBL_639602 (CHEMBL1175135)
Ki
105±n/a nM
Citation
 Coleman, PJSchreier, JDRoecker, AJMercer, SPMcGaughey, GBCox, CDHartman, GDHarrell, CMReiss, DRDoran, SMGarson, SLAnderson, WBTang, CPrueksaritanont, TWinrow, CJRenger, JJ Discovery of 3,9-diazabicyclo[4.2.1]nonanes as potent dual orexin receptor antagonists with sleep-promoting activity in the rat. Bioorg Med Chem Lett 20:4201-5 (2010)  
Target
Name:
Orexin receptor type 2
Synonyms:
HCRTR2 OX2R_HUMAN Orexin receptor type 2 (OR-2) Orexin receptor type 2 (OX2R) Ox-2-R | Ox2-R
Type:
Protein
Mol. Mass.:
50710.53
Organism:
Homo sapiens (Human)
Description:
O43614
Residue:
444
  
Inhibitor
Name:
BDBM50321514
Synonyms:
((1S,5S)-6-(7-fluoroquinazolin-2-yl)-2,6-diazabicyclo[3.2.2]nonan-2-yl)(5-methyl-2-(2H-1,2,3-triazol-2-yl)phenyl)methanone | CHEMBL1171766
Type:
Small organic molecule
Emp. Form.:
C25H24FN7O
Mol. Mass.:
457.5028
SMILES:
Cc1ccc(c(c1)C(=O)N1CC[C@@H]2CC[C@H]1CN2c1ncc2ccc(F)cc2n1)-n1nccn1
: