Target
Histamine H3 receptor
Ligand
BDBM50321829
Substrate
Meas. Tech.
ChEMBL_643311 (CHEMBL1177482)
Ki
127±n/a nM
Citation
 Ishikawa, MFuruuchi, TYamauchi, MYokoyama, FKakui, NSato, Y Synthesis and structure-activity relationships of N-aryl-piperidine derivatives as potent (partial) agonists for human histamine H3 receptor. Bioorg Med Chem 18:5441-8 (2010)  
Target
Name:
Histamine H3 receptor
Synonyms:
G-protein coupled receptor 97 HH3R HRH3 Histamine H3 receptor (H3) Histamine receptor (H3 and H4)
Type:
G Protein-Coupled Receptor (GPCR)
Mol. Mass.:
48691.47
Organism:
Homo sapiens (Human)
Description:
Binding assays were using CHO cells stably expressing hH3R receptors.
Residue:
445
  
Inhibitor
Name:
BDBM50321829
Synonyms:
3-(4-((1H-Imidazol-4-yl)methyl)piperidin-1-yl)pyridine | CHEMBL1173033
Type:
Small organic molecule
Emp. Form.:
C14H18N4
Mol. Mass.:
242.3195
SMILES:
C(C1CCN(CC1)c1cccnc1)c1cnc[nH]1
: