Target
Steroid 17-alpha-hydroxylase/17,20 lyase
Ligand
BDBM50322791
Substrate
Meas. Tech.
ChEMBL_642391 (CHEMBL1177584)
IC50
186±n/a nM
Citation
 Hu, QYin, LJagusch, CHille, UEHartmann, RW Isopropylidene substitution increases activity and selectivity of biphenylmethylene 4-pyridine type CYP17 inhibitors. J Med Chem 53:5049-53 (2010)  
Target
Name:
Steroid 17-alpha-hydroxylase/17,20 lyase
Synonyms:
CP17A_HUMAN CYP17A1 Cytochrome P450 17A1 Cytochrome P450 C17 (CYP17) Cytochrome P450-C17 P450-C17 Steroid 17-alpha-Monooxygenase (CYP17) Steroid 17-alpha-monooxygenase | cytochrome P450 monooxygenase 17 alpha hydroxylase/17,20-lyase (CYP17)
Type:
Enzyme
Mol. Mass.:
57382.42
Organism:
Homo sapiens (Human)
Description:
E.coli expressing human CYP17
Residue:
508
  
Inhibitor
Name:
BDBM50322791
Synonyms:
3-Fluoro-4'-(pyridin-4-ylmethyl)biphenyl-4-ol | CHEMBL1173260
Type:
Small organic molecule
Emp. Form.:
C18H14FNO
Mol. Mass.:
279.3083
SMILES:
Oc1ccc(cc1F)-c1ccc(Cc2ccncc2)cc1
: