Target
Cytochrome P450 11B1, mitochondrial
Ligand
BDBM50322790
Substrate
Meas. Tech.
ChEMBL_642392 (CHEMBL1177585)
IC50
3100±n/a nM
Citation
 Hu, QYin, LJagusch, CHille, UEHartmann, RW Isopropylidene substitution increases activity and selectivity of biphenylmethylene 4-pyridine type CYP17 inhibitors. J Med Chem 53:5049-53 (2010)  
Target
Name:
Cytochrome P450 11B1, mitochondrial
Synonyms:
C11B1_HUMAN CYPXIB1 Cytochrome P450 11B1 Cytochrome P450 11B1, mitochondrial | S11BH
Type:
Enzyme
Mol. Mass.:
57591.44
Organism:
Homo sapiens (Human)
Description:
P15538
Residue:
503
  
Inhibitor
Name:
BDBM50322790
Synonyms:
4'-(2-methyl-1-(pyridin-4-yl)prop-1-enyl)biphenyl-3-ol | CHEMBL1173259
Type:
Small organic molecule
Emp. Form.:
C21H19NO
Mol. Mass.:
301.3817
SMILES:
[#6]\[#6](-[#6])=[#6](/c1ccncc1)-c1ccc(cc1)-c1cccc(-[#8])c1
: