Target
Cytochrome P450 11B1, mitochondrial
Ligand
BDBM50322793
Substrate
Meas. Tech.
ChEMBL_642392 (CHEMBL1177585)
IC50
1400±n/a nM
Citation
 Hu, QYin, LJagusch, CHille, UEHartmann, RW Isopropylidene substitution increases activity and selectivity of biphenylmethylene 4-pyridine type CYP17 inhibitors. J Med Chem 53:5049-53 (2010)  
Target
Name:
Cytochrome P450 11B1, mitochondrial
Synonyms:
C11B1_HUMAN CYPXIB1 Cytochrome P450 11B1 Cytochrome P450 11B1, mitochondrial | S11BH
Type:
Enzyme
Mol. Mass.:
57591.44
Organism:
Homo sapiens (Human)
Description:
P15538
Residue:
503
  
Inhibitor
Name:
BDBM50322793
Synonyms:
4'-(Pyridin-4-ylmethyl)biphenyl-3,4-diol | CHEMBL1172779
Type:
Small organic molecule
Emp. Form.:
C18H15NO2
Mol. Mass.:
277.3172
SMILES:
Oc1ccc(cc1O)-c1ccc(Cc2ccncc2)cc1
: