Target
Cytochrome P450 11B2, mitochondrial
Ligand
BDBM50322794
Substrate
Meas. Tech.
ChEMBL_642393 (CHEMBL1177586)
IC50
974±n/a nM
Citation
 Hu, QYin, LJagusch, CHille, UEHartmann, RW Isopropylidene substitution increases activity and selectivity of biphenylmethylene 4-pyridine type CYP17 inhibitors. J Med Chem 53:5049-53 (2010)  
Target
Name:
Cytochrome P450 11B2, mitochondrial
Synonyms:
Aldosterone Synthase (CYP11B2) Aldosterone-synthesizing enzyme CYP11B2 Cytochrome P450 11B2 Cytochrome P450 11B2, mitochondrial P-450C18 | Steroid 18-hydroxylase
Type:
Protein
Mol. Mass.:
57582.15
Organism:
Homo sapiens (Human)
Description:
P19099
Residue:
503
  
Inhibitor
Name:
BDBM50322794
Synonyms:
4'-(2-methyl-1-(pyridin-4-yl)prop-1-enyl)biphenyl-3,4-diol | CHEMBL1172847
Type:
Small organic molecule
Emp. Form.:
C21H19NO2
Mol. Mass.:
317.3811
SMILES:
[#6]\[#6](-[#6])=[#6](/c1ccncc1)-c1ccc(cc1)-c1ccc(-[#8])c(-[#8])c1
: