Target
Aromatase
Ligand
BDBM50322793
Substrate
Meas. Tech.
ChEMBL_642394 (CHEMBL1177587)
IC50
2440±n/a nM
Citation
 Hu, QYin, LJagusch, CHille, UEHartmann, RW Isopropylidene substitution increases activity and selectivity of biphenylmethylene 4-pyridine type CYP17 inhibitors. J Med Chem 53:5049-53 (2010)  
Target
Name:
Aromatase
Synonyms:
ARO1 CP19A_HUMAN CYP19 CYPXIX Cytochrome P450 19A1 Cytochrome P450-C19 (CYP19) FL cytokine receptor precursor | P-450AROM
Type:
Enzyme
Mol. Mass.:
57888.92
Organism:
Homo sapiens (Human)
Description:
P11511
Residue:
503
  
Inhibitor
Name:
BDBM50322793
Synonyms:
4'-(Pyridin-4-ylmethyl)biphenyl-3,4-diol | CHEMBL1172779
Type:
Small organic molecule
Emp. Form.:
C18H15NO2
Mol. Mass.:
277.3172
SMILES:
Oc1ccc(cc1O)-c1ccc(Cc2ccncc2)cc1
: