Target
Cytochrome P450 3A4
Ligand
BDBM50322789
Substrate
Meas. Tech.
ChEMBL_642395 (CHEMBL1177588)
IC50
538±n/a nM
Citation
 Hu, QYin, LJagusch, CHille, UEHartmann, RW Isopropylidene substitution increases activity and selectivity of biphenylmethylene 4-pyridine type CYP17 inhibitors. J Med Chem 53:5049-53 (2010)  
Target
Name:
Cytochrome P450 3A4
Synonyms:
Albendazole monooxygenase CP3A4_HUMAN CYP3A4 CYPIIIA4 Cytochrome P450 3A4 (CYP3A4) Nifedipine oxidase Taurochenodeoxycholate 6-alpha-hydroxylase
Type:
Enzyme
Mol. Mass.:
57349.57
Organism:
Homo sapiens (Human)
Description:
Residue:
503
  
Inhibitor
Name:
BDBM50322789
Synonyms:
4'-(pyridin-4-ylmethyl)biphenyl-3-ol CHEMBL1172882
Type:
Small organic molecule
Emp. Form.:
C18H15NO
Mol. Mass.:
261.3178
SMILES:
Oc1cccc(c1)-c1ccc(Cc2ccncc2)cc1
: