Target
Cytochrome P450 11B1, mitochondrial
Ligand
BDBM50322785
Substrate
Meas. Tech.
ChEMBL_642392 (CHEMBL1177585)
IC50
502±n/a nM
Citation
 Hu, QYin, LJagusch, CHille, UEHartmann, RW Isopropylidene substitution increases activity and selectivity of biphenylmethylene 4-pyridine type CYP17 inhibitors. J Med Chem 53:5049-53 (2010)  
Target
Name:
Cytochrome P450 11B1, mitochondrial
Synonyms:
C11B1_HUMAN CYPXIB1 Cytochrome P450 11B1 Cytochrome P450 11B1, mitochondrial | S11BH
Type:
Enzyme
Mol. Mass.:
57591.44
Organism:
Homo sapiens (Human)
Description:
P15538
Residue:
503
  
Inhibitor
Name:
BDBM50322785
Synonyms:
4'-(Pyridin-4-ylmethyl)biphenyl-3,4-diamine | CHEMBL1173327
Type:
Small organic molecule
Emp. Form.:
C18H17N3
Mol. Mass.:
275.3477
SMILES:
Nc1ccc(cc1N)-c1ccc(Cc2ccncc2)cc1
: