Target
Transcriptional activator protein LuxR
Ligand
BDBM61401
Substrate
Meas. Tech.
ChEMBL_643998 (CHEMBL1211897)
IC50
91000±n/a nM
Citation
 Soulère, LSabbah, MFontaine, FQueneau, YDoutheau, A LuxR-dependent quorum sensing: computer aided discovery of new inhibitors structurally unrelated to N-acylhomoserine lactones. Bioorg Med Chem Lett 20:4355-8 (2010)  
Target
Name:
Transcriptional activator protein LuxR
Synonyms:
LUXR_ALIFS | luxR
Type:
PROTEIN
Mol. Mass.:
28563.86
Organism:
Vibrio fischeri
Description:
ChEMBL_831639
Residue:
250
  
Inhibitor
Name:
BDBM61401
Synonyms:
3,3-diphenyl-N-(1-phenylethyl)-1-propanamine;hydrochloride 3,3-diphenylpropyl(1-phenylethyl)amine;hydrochloride FENDILINE HYDROCHLORIDE SMR000058827 | cid_5702162
Type:
Small organic molecule
Emp. Form.:
C23H25N
Mol. Mass.:
315.4513
SMILES:
CC(NCCC(c1ccccc1)c1ccccc1)c1ccccc1
: