Target
Cysteinyl leukotriene receptor 1
Ligand
BDBM50323881
Substrate
Meas. Tech.
ChEMBL_647615 (CHEMBL1219966)
IC50
2±n/a nM
Citation
 Dong, XWang, LHuang, XLiu, TWei, EDu, LYang, BHu, Y Pharmacophore identification, synthesis, and biological evaluation of carboxylated chalcone derivatives as CysLT1 antagonists. Bioorg Med Chem 18:5519-27 (2010)  
Target
Name:
Cysteinyl leukotriene receptor 1
Synonyms:
CLTR1_HUMAN CYSLTR1 Cysteinyl leukotriene receptor HG55 LTD4 receptor | Leukotriene Cysteinyl 1
Type:
Enzyme Catalytic Domain
Mol. Mass.:
38565.16
Organism:
Homo sapiens (Human)
Description:
Leukotriene Cysteinyl 1 CYSLTR1 HUMAN::Q9Y271
Residue:
337
  
Inhibitor
Name:
BDBM50323881
Synonyms:
CHEMBL1214477 | N-(3-(((3S,4R)-6-((5,6-difluorobenzo[d]thiazol-2-yl)methoxy)-4-(hydroxymethyl)-2,2-dimethylchroman-3-yl)methyl)-4-methoxyphenyl)-1,1,1-trifluoromethanesulfonamide
Type:
Small organic molecule
Emp. Form.:
C29H27F5N2O6S2
Mol. Mass.:
658.656
SMILES:
COc1ccc(NS(=O)(=O)C(F)(F)F)cc1C[C@H]1[C@@H](CO)c2cc(OCc3nc4cc(F)c(F)cc4s3)ccc2OC1(C)C
: