Target
Segment polarity protein dishevelled homolog DVL-2
Ligand
BDBM50378800
Substrate
Meas. Tech.
ChEMBL_651099 (CHEMBL1227540)
Ki
700±n/a nM
Citation
 Zhang, YAppleton, BAWiesmann, CLau, TCosta, MHannoush, RNSidhu, SS Inhibition of Wnt signaling by Dishevelled PDZ peptides. Nat Chem Biol 5:217-9 (2009)  
Target
Name:
Segment polarity protein dishevelled homolog DVL-2
Synonyms:
DSH homolog 2 DVL2_HUMAN | Dishevelled-2
Type:
PROTEIN
Mol. Mass.:
78940.00
Organism:
Homo sapiens (Human)
Description:
ChEMBL_651099
Residue:
736
  
Inhibitor
Name:
BDBM50378800
Synonyms:
CHEMBL1221418
Type:
Small organic molecule
Emp. Form.:
C59H65N11O9
Mol. Mass.:
1072.2157
SMILES:
NCCCC[C@H](NC(=O)[C@@H](N)Cc1c[nH]c2ccccc12)C(=O)N[C@@H](Cc1c[nH]c2ccccc12)C(=O)N[C@@H](Cc1ccc(O)cc1)C(=O)NCC(=O)N[C@@H](Cc1c[nH]c2ccccc12)C(=O)N[C@@H](Cc1ccccc1)C(O)=O
: