Target
Muscarinic acetylcholine receptor M4
Ligand
BDBM50326219
Substrate
Meas. Tech.
ChEMBL_659505 (CHEMBL1248558)
Ki
<1000±n/a nM
Citation
 Sams, AGHentzer, MMikkelsen, GKLarsen, KBundgaard, CPlath, NChristoffersen, CTBang-Andersen, B Discovery of N-{1-[3-(3-oxo-2,3-dihydrobenzo[1,4]oxazin-4-yl)propyl]piperidin-4-yl}-2-phenylacetamide (Lu AE51090): an allosteric muscarinic M1 receptor agonist with unprecedented selectivity and procognitive potential. J Med Chem 53:6386-97 (2010)  
Target
Name:
Muscarinic acetylcholine receptor M4
Synonyms:
ACM4_HUMAN Cholinergic, muscarinic M4 Muscarinic acetylcholine receptor M2 and M4
Type:
Enzyme Catalytic Domain
Mol. Mass.:
53079.31
Organism:
Homo sapiens (Human)
Description:
Cholinergic, muscarinic M4 CHRM4 HUMAN M3::P08173
Residue:
479
  
Inhibitor
Name:
BDBM50326219
Synonyms:
4-(4-butylpiperidin-1-yl)-1-o-tolylbutan-1-one CHEMBL2206334
Type:
Small organic molecule
Emp. Form.:
C20H31NO
Mol. Mass.:
301.4662
SMILES:
CCCCC1CCN(CCCC(=O)c2ccccc2C)CC1
: