Target
5-hydroxytryptamine receptor 1A
Ligand
BDBM50326218
Substrate
Meas. Tech.
ChEMBL_659496 (CHEMBL1248549)
Ki
<1000±n/a nM
Citation
 Sams, AGHentzer, MMikkelsen, GKLarsen, KBundgaard, CPlath, NChristoffersen, CTBang-Andersen, B Discovery of N-{1-[3-(3-oxo-2,3-dihydrobenzo[1,4]oxazin-4-yl)propyl]piperidin-4-yl}-2-phenylacetamide (Lu AE51090): an allosteric muscarinic M1 receptor agonist with unprecedented selectivity and procognitive potential. J Med Chem 53:6386-97 (2010)  
Target
Name:
5-hydroxytryptamine receptor 1A
Synonyms:
5-HT-1A 5-hydroxytryptamine receptor 1A (5-HT-1A) ADRB2RL1 Dopamine D2 receptor and serotonin 1a receptor HTR1A | Serotonin receptor 1A
Type:
Mol. Mass.:
46122.49
Organism:
Homo sapiens (Human)
Description:
Residue:
422
  
Inhibitor
Name:
BDBM50326218
Synonyms:
CHEMBL1242923 | N-{1-[3-(3-Oxo-2,3-dihydrobenzo[1,4]oxazin-4-yl)propyl]-piperidin-4-yl}-2-phenylacetamide
Type:
Small organic molecule
Emp. Form.:
C24H29N3O3
Mol. Mass.:
407.5054
SMILES:
O=C(Cc1ccccc1)NC1CCN(CCCN2C(=O)COc3ccccc23)CC1
: