Target
Delta-type opioid receptor
Ligand
BDBM50001683
Substrate
Meas. Tech.
ChEMBL_662214 (CHEMBL1252205)
Ki
2.7±n/a nM
Citation
 Pasquinucci, LPrezzavento, OMarrazzo, AAmata, ERonsisvalle, SGeorgoussi, ZFourla, DDScoto, GMParenti, CAricò, GRonsisvalle, G Evaluation of N-substitution in 6,7-benzomorphan compounds. Bioorg Med Chem 18:4975-82 (2010)  
Target
Name:
Delta-type opioid receptor
Synonyms:
Cytochrome P450 3A4 Delta opioid receptor Delta-type opioid receptor (DOR) OPRD_RAT Opioid receptor Opioid receptors; mu & delta Ror-a | Voltage-gated potassium channel
Type:
G Protein-Coupled Receptor (GPCR)
Mol. Mass.:
40465.04
Organism:
Rattus norvegicus (rat)
Description:
Competition binding assays were using CHO-K1 cell membranes expressing the opioid receptor.
Residue:
372
  
Inhibitor
Name:
BDBM50001683
Synonyms:
13-[2-Amino-3-(4-hydroxy-phenyl)-propionylamino]-7-benzyl-3,3,14,14-tetramethyl-6,9,12-trioxo-1,2-dithia-5,8,11-triaza-cyclotetradecane-4-carboxylic acid CHEMBL294616 | DPDPE
Type:
Small organic molecule
Emp. Form.:
C30H39N5O7S2
Mol. Mass.:
645.79
SMILES:
CC1(C)SSC(C)(C)[C@@H](NC(=O)[C@@H](N)Cc2ccc(O)cc2)C(=O)NCC(=O)N[C@H](Cc2ccccc2)C(=O)N[C@H]1C(O)=O
: