Target
Coagulation factor X
Ligand
BDBM50273136
Substrate
Meas. Tech.
ChEMBL_675275 (CHEMBL1273257)
Ki
5±n/a nM
Citation
 Pinto, DJSmallheer, JMCheney, DLKnabb, RMWexler, RR Factor Xa inhibitors: next-generation antithrombotic agents. J Med Chem 53:6243-74 (2010)  
Target
Name:
Coagulation factor X
Synonyms:
Activated coagulation factor X (FXa) Coagulation factor X precursor F10 Factor X heavy chain Factor Xa Stuart-Prower factor
Type:
Enzyme
Mol. Mass.:
54726.60
Organism:
Homo sapiens (Human)
Description:
Residue:
488
  
Inhibitor
Name:
BDBM50273136
Synonyms:
CHEMBL455932 {4-[2-(5-Carbamimidoyl-2-hydroxy-benzenesulfonylamino)-ethyl]-2'-methanesulfonyl-biphenyl-3-yloxy}-acetic acid; hydrochloride
Type:
Small organic molecule
Emp. Form.:
C24H25N3O8S2
Mol. Mass.:
547.601
SMILES:
CS(=O)(=O)c1ccccc1-c1ccc(CCNS(=O)(=O)c2cc(ccc2O)C(N)=N)c(OCC(O)=O)c1
: