Target
Sialidase-3
Ligand
BDBM5025
Substrate
Meas. Tech.
ChEMBL_687672 (CHEMBL1291056)
IC50
>10000000±n/a nM
Citation
 Zou, YAlbohy, ASandbhor, MCairo, CW Inhibition of human neuraminidase 3 (NEU3) by C9-triazole derivatives of 2,3-didehydro-N-acetyl-neuraminic acid. Bioorg Med Chem Lett 20:7529-33 (2010)  
Target
Name:
Sialidase-3
Synonyms:
NEU3 Sialidase 3 | Sialidase-3
Type:
PROTEIN
Mol. Mass.:
48257.99
Organism:
Homo sapiens (Human)
Description:
ChEMBL_461856
Residue:
428
  
Inhibitor
Name:
BDBM5025
Synonyms:
Oseltamivir ethyl (3R,4R,5S)-5-amino-4-acetamido-3-(pentan-3-yloxy)cyclohex-1-ene-1-carboxylate
Type:
Small organic molecule
Emp. Form.:
C16H28N2O4
Mol. Mass.:
312.4045
SMILES:
[H][C@@]1(OC(CC)CC)C=C(C[C@H](N)[C@H]1NC(C)=O)C(=O)OCC
: