Target
Glucocorticoid receptor
Ligand
BDBM50334952
Substrate
Meas. Tech.
ChEMBL_702551 (CHEMBL1657195)
EC50
25300±n/a nM
Citation
 Gilmer, JFPrichard, DMajer, FByrne, AMKelleher, DLong, ASharma, R Ursodeoxycholic acid amides as novel glucocorticoid receptor modulators. J Med Chem 54:122-30 (2011)  
Target
Name:
Glucocorticoid receptor
Synonyms:
GCR_HUMAN GRL Glucocorticoid receptor (GRFP) Nuclear receptor subfamily 3 group C member 1
Type:
Enzyme
Mol. Mass.:
85656.87
Organism:
Homo sapiens (Human)
Description:
P04150
Residue:
777
  
Inhibitor
Name:
BDBM50334952
Synonyms:
24-morpholine-3alpha,7beta-dihydroxy-5beta-cholanamide | CHEMBL1649689
Type:
Small organic molecule
Emp. Form.:
C28H47NO4
Mol. Mass.:
461.6771
SMILES:
C[C@H](CCC(=O)N1CCOCC1)[C@H]1CC[C@H]2[C@@H]3[C@@H](O)C[C@@H]4C[C@H](O)CC[C@]4(C)[C@H]3CC[C@]12C
: