Target
Glucocorticoid receptor
Ligand
BDBM50334954
Substrate
Meas. Tech.
ChEMBL_702551 (CHEMBL1657195)
EC50
123500±n/a nM
Citation
 Gilmer, JFPrichard, DMajer, FByrne, AMKelleher, DLong, ASharma, R Ursodeoxycholic acid amides as novel glucocorticoid receptor modulators. J Med Chem 54:122-30 (2011)  
Target
Name:
Glucocorticoid receptor
Synonyms:
GCR_HUMAN GRL Glucocorticoid receptor (GRFP) Nuclear receptor subfamily 3 group C member 1
Type:
Enzyme
Mol. Mass.:
85656.87
Organism:
Homo sapiens (Human)
Description:
P04150
Residue:
777
  
Inhibitor
Name:
BDBM50334954
Synonyms:
24-alpha-methylbenzyl-3alpha,7beta-dihydroxy-5beta-cholanamide | CHEMBL1649691
Type:
Small organic molecule
Emp. Form.:
C32H49NO3
Mol. Mass.:
495.7364
SMILES:
C[C@H](CCC(=O)NC(C)c1ccccc1)[C@H]1CC[C@H]2[C@@H]3[C@@H](O)C[C@@H]4C[C@H](O)CC[C@]4(C)[C@H]3CC[C@]12C
: